First Name,Last Name,Email,Spirit Animal,University Name,School Name,Year,Subscribed Plan,Payment Type,Subscription Date,Expiry Date,Plan Status
Luke,Adkison,lukeadkison@gmail.com,,,University of Pikeville-Kentucky College of Osteopathic Medicine,3rd Year,Free,,03/29/2024 01:50:14,,Active
Yonatan,Shemesh,yonatansh22@gmail.com,,,Ben Gurion University of the Negev,1st Year,Free,,03/28/2024 18:55:03,,Active
lalo,makala,dosape4182@wousi.com,,,Boston University School of Medicine,Other,Free,,03/27/2024 18:13:31,,Active
Maa,Rad,mahla.radmard@yahoo.com,,,Johns Hopkins University School of Medicine,Other,Free,,03/26/2024 13:11:55,,Active
Sawaira ,Murad,sawairamurad@gmail.com,Eagle ,,Baylor College of Medicine,4th Year,Free,,03/26/2024 07:17:37,,Active
joelle,fakih,joelle.fakih@gmail.com,,,Michigan State University College of Human Medicine,2nd Year,Free,,03/25/2024 17:59:14,,Active
Arielle,Rad,ariellemradparvar@gmail.com,,,California University of Science and Medicine ? School of Medicine,2nd Year,Free,,03/24/2024 22:56:43,,Active
arielle,radparvar,ariellemradparvar@gmal.com,,,California University of Science and Medicine ? School of Medicine,2nd Year,Free,,03/24/2024 22:53:41,,Active
Elena,Ayuso,elorm@udel.edu,,,Johns Hopkins University School of Medicine,Other,Step 1,Stripe,03/24/2024 00:00:00,04/25/2024 00:36:11,Active
Zaid,Kaabneh,zaidkaabneh@yahoo.com,,,Qatar University College of Medicine,4th Year,Free,,03/22/2024 12:53:09,,Active
Anthony,Larson,larson83@rowan.edu,cheetah,,Rowan University School of Osteopathic Medicine,2nd Year,Free,,03/22/2024 12:05:15,,Active
Omer,Atli,omat.omat.5690@gmail.com,,,Albany Medical College,4th Year,Free,,03/22/2024 10:39:46,,Active
Fiona,McConnell,fificork@icloud.com,,,Other,Other,Step 1,Stripe,03/22/2024 00:00:00,04/22/2024 04:30:54,Active
Monica,Choi,monicachoi97@gmail.com,,,Case Western Reserve University School of Medicine,3rd Year,Free,,03/21/2024 00:18:38,,Active
zahra,munshi,zahra786kgn@hotmail.com,,,The Warren Alpert Medical School of Brown University,1st Year,Free,,03/20/2024 16:55:15,,Active
Omar,elazab,omar_azab@hotmail.com,,,Other,Other,Free,,03/20/2024 10:37:15,,Active
emily,alv,2015.e.alvarez@gmail.com,,,Columbia University Vagelos College of Physicians and Surgeons,4th Year,Free,,03/20/2024 00:30:13,,Active
Ryan,wood,ryanwood682@gmail.com,,,TCU and UNTHSC School of Medicine,1st Year,Free,,03/18/2024 15:45:03,,Active
Fatima,AlMuhairi,fatima.almuhairi@outlook.com,,,Other,3rd Year,Free,,03/18/2024 01:33:21,,Active
mel,cummings,mcummings1662@gmail.com,,,Lincoln Memorial University-DeBusk College of Osteopathic Medicine,2nd Year,Free,,03/17/2024 05:25:45,,Active
Parnia,Behinaein,parnia.behinaein@wayne.edu,Butterfly,,Wayne State University School of Medicine,2nd Year,Free,,03/14/2024 04:29:24,,Active
Prince,Emmanuel,emmaprinciple@gmail.com,,,Other,Other,Free,,03/12/2024 12:36:48,,Active
Adwoa,Wilson,maameafriyie1@gmail.com,,,Other,Other,Free,,03/12/2024 10:54:12,,Active
viraj,ladhani,virajladhani@gmail.com,,,Other,3rd Year,Free,,03/12/2024 10:36:58,,Active
Chetan,Kashinkunti,drchetan.sk@gmail.com,,,Baylor College of Medicine,Other,Step 2,Stripe,03/12/2024 00:00:00,04/02/2024 19:33:02,canceled
qi,ming,1249682045@qq.com,,,Albany Medical College,Other,Free,,03/11/2024 17:33:30,,Active
adia,Gomes,apg123go@gmail.com,,,University of Florida College of Medicine,2nd Year,Free,,03/06/2024 17:39:50,,Active
preeti,nadagouda,pnadagouda@seu.edu.ge,Tortoise,,Johns Hopkins University School of Medicine,3rd Year,Free,,03/06/2024 08:56:57,,Active
Ahmad,Mohammed,mohammedmohammedahmadahmad@gmail.com,,,Indiana University School of Medicine,1st Year,Free,,03/05/2024 19:09:05,,Active
Hiba,Fadlallah,hibafadlallah11@gmail.com,,,American University of Antigua,3rd Year,Free,,03/05/2024 09:24:33,,Active
Kevin,Holsey,kevinholsey4@gmail.com,,,Lewis Katz School of Medicine at Temple University,1st Year,Free,,03/03/2024 18:33:46,,Active
Pinrong,Chen,u109001026@gap.kmu.edu.tw,,,University of Nebraska College of Medicine,2nd Year,Free,,02/28/2024 04:44:11,,Active
sobeira,fillad,stfillad@gmail.com,dog,,Western University of Health Sciences/College of Osteopathic Medicine of the Pacific,2nd Year,Step 1,Stripe,02/28/2024 00:00:00,03/14/2024 05:04:28,Expired
Dana,AbuQuood,dana.abuquood@gmail.com,,,Stanford University School of Medicine,4th Year,Free,,02/27/2024 17:28:10,,Active
sam,Sam,dr.makedonskaia@icloud.com,,,University of Amsterdam,Other,Free,,02/24/2024 03:48:02,,Active
Blaze,Beecher,beecherbn@gmail.com,,,Other,3rd Year,Free,,02/23/2024 19:25:22,,Active
George,Trahan,gtrahan@nyit.edu,,,New York Institute of Technology College of Osteopathic Medicine at Arkansas State,1st Year,Step 1,Stripe,02/23/2024 00:00:00,03/01/2024 12:50:17,Expired
lydia,rykard,lydiarykard@gmail.com,,,A.T. Still University-Kirksville College of Osteopathic Medicine,3rd Year,Free,,02/22/2024 06:57:37,,Active
Raphael,Agbavitor,agbavitor7285raphael@gmail.com,,,Albany Medical College,Other,Free,,02/22/2024 00:45:43,,Active
Vanshika,Chaudhary,vanshika7988@gmail.com,,,Harvard Medical School,2nd Year,Free,,02/21/2024 13:31:42,,Active
MIMI,MON,yisigiy206@massefm.com,,,Albert Einstein College of Medicine,1st Year,Free,,02/20/2024 20:51:22,,Active
shriha,patel,shriha.patel@gmail.com,,,Lake Erie College of Osteopathic Medicine,2nd Year,Free,,02/20/2024 05:26:48,,Active
Richard,Thomson,richardmthomson@doctors.org.uk,,,The University of Texas Health Science Center at San Antonio Joe R. and Teresa Lozano Long School of Medicine,Other,Step 1,Manual,02/20/2024 00:00:00,04/30/2024 00:00:00,Active
Anthony,Castelvecchi,tonycastelvecchi@aol.com,Wolf,,Chicago College of Osteopathic Medicine of Midwestern University,3rd Year,Free,,02/17/2024 20:26:40,,Active
Wazinita,Obeng,obeng.wazi@gmail.com,,,Harvard Medical School,Other,Free,,02/17/2024 12:12:00,,Active
Vivian,Rojas,vnrojas@utmb.edu,Turtle,,The University of Texas Medical Branch at Galveston School of Medicine,4th Year,Free,,02/16/2024 02:21:03,,Active
Amin,Alias,mdalias1@yahoo.com,Lion,,Universidad Central del Caribe School of Medicine,4th Year,Step 1,Manual,02/16/2024 00:00:00,07/01/2024 00:00:00,Active
Ananya,Dbarman,debbarmaananya@gmail.com,,,Other,Other,Free,,02/15/2024 17:48:46,,Active
Adaugo,Okpareke,aokpareke@gmail.com,,,Morehouse School of Medicine,2nd Year,Free,,02/13/2024 14:07:01,,Active
rob,hance,husks-chunk.0b@icloud.com,,,Baylor College of Medicine,2nd Year,Free,,02/13/2024 13:06:41,,Active
miria,daSilva,miria.ferreira@medicina.ufjf.br,,,Other,Other,Free,,02/10/2024 00:41:52,,Active
fds,sdf,hirivop300@laymro.com,,,Arizona College of Osteopathic Medicine of Midwestern University,2nd Year,Free,,02/09/2024 10:12:54,,Active
Jill,Scribner,jillscribner96@gmail.com,,,University of Michigan Medical School,Other,Free,,02/08/2024 15:03:18,,Active
Emilio,Cavazos Escobar,emicavaz@utmb.edu,hhh,,The University of Texas Medical Branch at Galveston School of Medicine,4th Year,Free,,02/07/2024 19:37:51,,Active
franklin,powell,frpowell1@gmail.com,,,University of Washington School of Medicine,2nd Year,Free,,02/07/2024 03:39:32,,Active
akashdeep,multani,singhakadh9@gmail.com,,,Albany Medical College,1st Year,Free,,02/06/2024 22:00:34,,Active
faeze,fayaz,faezefyyz@gmail.com,,,Boston University School of Medicine,4th Year,Free,,02/05/2024 15:42:40,,Active
Allen,Palama,efe6may@gmail.com,,,Saint George's University School of Medicine,3rd Year,Free,,02/05/2024 04:35:50,,Active
Liaan,vanderSchyf,lvanderschyf@gmail.com,Cat,,Southeast University in China,Other,Free,,02/04/2024 18:27:38,,Active
Enrique,Avila,eavila@mcw.edu,Jaguar,,Medical College of Wisconsin,3rd Year,Step 1,Stripe,02/01/2024 00:00:00,03/01/2024 14:41:05,Expired
Carla,Alvarez,carlaalv07@gmail.com,,,Universidad Central del Caribe School of Medicine,4th Year,Free,,01/30/2024 23:18:02,,Active
Mario,Loera,marioloerajr@gmail.com,Eagle,,Other,4th Year,Free,,01/30/2024 16:58:25,,Active
Dharti,Patel,dha.patel2020@gmail.com,,,Boston University School of Medicine,1st Year,Free,,01/29/2024 01:17:21,,Active
Sara,SM,smnote95@gmail.com,,,Other,Other,Free,,01/28/2024 20:24:55,,Active
Youngsu,Gong,acidrain1989@naver.com,,,Other,Other,Free,,01/27/2024 13:09:42,,Active
Youngsu,Gong,blazers-passion0b@icloud.com,,,Other,Other,Free,,01/27/2024 13:07:09,,Active
Saif,Khan,ksaif49018@gmail.com,Nothing ,,A.T. Still University-Kirksville College of Osteopathic Medicine,4th Year,Free,,01/27/2024 04:23:54,,Active
Peter,Youssef,pyoussef@msm.edu,,,Morehouse School of Medicine,3rd Year,Step 2,Stripe,01/27/2024 00:00:00,04/25/2024 00:00:00,Active
Melanie,Aing,msaing@utmb.edu,,,The University of Texas Medical Branch at Galveston School of Medicine,4th Year,Free,,01/26/2024 18:44:01,,Active
basel,Hamwi,bahamwi@utmb.edu,cow,,The University of Texas Medical Branch at Galveston School of Medicine,4th Year,Free,,01/25/2024 13:50:13,,Active
Hyun Mok,Kang,skang7473@gmail.com,,,Creighton University School of Medicine,1st Year,Free,,01/25/2024 05:10:03,,Active
James,Pike,do26.jrpike@noordacom.org,,,University of Utah School of Medicine,2nd Year,Free,,01/25/2024 00:45:57,,Active
Roma,Babaevi,babaevir@gmail.com,,,Other,4th Year,Free,,01/24/2024 22:28:25,,Active
Zitlalt,Maldonado,zitl.maldonado@gmail.com,,,Latin American School of Medicine,Other,Free,,01/24/2024 19:08:40,,Active
Aaziah,Daniel,azd3of4@gmail.com,,,Other,3rd Year,Free,,01/24/2024 16:27:24,,Active
Sarina,Scott,sarina.scott@hsc.utah.edu,,,University of Utah School of Medicine,2nd Year,Free,,01/24/2024 14:40:39,,Active
Sebastian,Mendoza,sebastianmendoza2696@icloud.com,,,University of Miami Leonard M. Miller School of Medicine,Other,Free,,01/23/2024 00:25:11,,Active
Alexis,Luedtke,lexiluedtke@gmail.com,,,Medical College of Wisconsin,1st Year,Free,,01/22/2024 15:00:15,,Active
Sarah,Liu,sarah.liu511@gmail.com,Sloth,,Kansas City University of Medicine and Biosciences College of Osteopathic Medicine?Joplin,Other,Free,,01/02/2024 02:35:59,,Active
Alex,Ofori,alexofori3@gmail.com,,,Other,Other,Step 2,Stripe,12/29/2023 00:00:00,03/27/2024 00:00:00,Expired
Prajjwal,Pokharel,prajjwal1703@gmail.com,Penguin,,University of Auckland,Other,Free,,12/26/2023 18:33:56,,Active
Pawan,Dubey,pawandubey1772@gmail.com,Wolf,,Alabama College of Osteopathic Medicine,2nd Year,Free,,12/21/2023 21:10:29,,Active
Jimmy,Gelin,jimmygelin580@gmail.com,,,Harvard Medical School,Other,Free,,12/19/2023 19:25:24,,Active
Jimmy,Gelin,cowbojim2001@yahoo.fr,success,,Harvard Medical School,Other,Free,,12/19/2023 19:15:51,,Active
Ami,Patel,amypatelmd@gmail.com,,,American University of Antigua,Other,Free,,12/15/2023 13:59:32,,Active
Kabir,bedi,kxb1000@miami.edu,,,University of Miami Leonard M. Miller School of Medicine,3rd Year,Free,,12/12/2023 17:06:07,,Active
Amit,Lucatz,Amitluc97@gmail.com,,,Other,Other,Free,,12/10/2023 10:10:08,,Active
justin,macneill,justinmacneill@gmail.com,,,Indiana University School of Medicine,2nd Year,Free,,12/09/2023 22:42:27,,Active
Alexis,Swift,broonera@vcu.edu,,,Virginia Commonwealth University School of Medicine,2nd Year,Free,,12/09/2023 20:24:20,,Active
Arkaprava,Das,arkapravadas8@gmail.com,,,Other,Other,Free,,12/08/2023 22:38:46,,Active
Nada,Wahba,wahba.nada@gmail.com,,,Rutgers New Jersey Medical School,2nd Year,Free,,12/07/2023 16:47:57,,Active
Yousef,Rafati,rafatiyousef@gmail.com,,,The University of Texas Medical Branch at Galveston School of Medicine,4th Year,Free,,12/07/2023 07:41:26,,Active
Michael,Still,mi572948@ucf.edu,,,University of Central Florida College of Medicine,2nd Year,Free,,12/06/2023 13:52:14,,Active
Victoria,Koshevarova,vakoshev@utmb.edu,Bat,,The University of Texas Medical Branch at Galveston School of Medicine,4th Year,Free,,12/05/2023 05:08:17,,Active
Symone,McClain,mccla097@umn.edu,,,University of Wisconsin School of Medicine and Public Health,4th Year,Free,,12/05/2023 03:27:55,,Active
shi,gor,sdg93@drexel.edu,,,Other,2nd Year,Free,,12/03/2023 18:20:25,,Active
john,nyakiti,johnyakiti@gmail.com,dog,,Texas A&M University Health Science Center College of Medicine,Other,Free,,12/03/2023 04:25:50,,Active
Kathryn,Cordova,Katie.cordova@bcm.edu,,,Baylor College of Medicine,3rd Year,Free,,12/02/2023 21:45:53,,Active
judi,obaji,jmo11233@rcsi.com,,,A.T. Still University-Kirksville College of Osteopathic Medicine,3rd Year,Free,,12/01/2023 17:08:29,,Active
ella,laast,ella_kovy@mail.ru,,,Case Western Reserve University School of Medicine,4th Year,Free,,12/01/2023 06:17:48,,Active
joanne,hol,joannehollandbarnes@gmail.com,,,Other,Other,Free,,11/29/2023 20:49:53,,Active
Francisco,Hola,fihf99@gmail.com,,,Other,3rd Year,Free,,11/29/2023 20:05:46,,Active
Chitra,Salgame,chitra@salgame.com,dog,,American University of Antigua,4th Year,Free,,11/29/2023 08:07:53,,Active
joanne,hol,joanne.holland@yahoo.com,,,Other,Other,Free,,11/28/2023 20:48:48,,Active
Grace,Obanigba,goobanig@utmb.edu,,,The University of Texas Medical Branch at Galveston School of Medicine,4th Year,Free,,11/28/2023 03:04:56,,Active
amin,ab,aminabshat9777@gmail.com,,,Johns Hopkins University School of Medicine,2nd Year,Free,,11/27/2023 21:42:08,,Active
didjana,Celkupa,djc560@gmail.com,,,Touro College of Osteopathic Medicine-New York,2nd Year,Free,,11/27/2023 16:38:13,,Active
Jamie,Gullikson,jamie.gullikson@gmail.com,,,Tufts University School of Medicine,2nd Year,Free,,11/26/2023 16:44:06,,Active
minh,tam,tamyd20032002@gmail.com,,,Hue University of Medicine and Pharmacy,Other,Free,,11/26/2023 10:37:44,,Active
Sirisha,Pasupuleti,sirishacp24@gmail.com,,,Michigan State University College of Osteopathic Medicine-Detroit,3rd Year,Free,,11/23/2023 00:25:02,,Active
austin,allen,basketball.32123@gmail.com,,,Rocky Vista University College of Osteopathic Medicine,1st Year,Free,,11/23/2023 00:21:09,,Active
Tammy,Weinrick,tammyw@auamed.net,Dolphin,,American University of Antigua,2nd Year,Free,,11/18/2023 20:22:48,,Active
Rutuja,Kadam,rkadam@ualberta.ca,,,William Carey University College of Osteopathic Medicine,2nd Year,Step 1,Stripe,11/17/2023 00:00:00,02/17/2024 06:49:02,Expired
Tigele,Dineo,202200157@ub.ac.bw,,,McGovern Medical School at The University of Texas Health Science Center at Houston,1st Year,Free,,11/15/2023 18:25:21,,Active
Hanan,Amr,hanank.amr2001@gmail.com,,,Other,Other,Free,,11/14/2023 07:08:53,,Active
Hanan,Amro,hanank.anr2001@gmail.com,,,Other,Other,Free,,11/13/2023 19:45:51,,Active
duygu,GELERI,du.bay@hotmail.com,unicorn,,University of Washington School of Medicine,Other,Free,,11/10/2023 23:51:07,,Active
Anisha,Dash,stargirl6141124@gmail.com,,,East Tennessee State University James H. Quillen College of Medicine,3rd Year,Free,,11/10/2023 19:59:58,,Active
dmitriy,Dutka,goodfantik@icloud.com,,,Other,4th Year,Free,,11/10/2023 19:55:20,,Active
brenton,bicknell,brentonb@uab.edu,,,University of Alabama School of Medicine,2nd Year,Free,,11/07/2023 23:57:06,,Active
Nancy,Burgess,vacationbug33@gmail.com,Dog,,Loma Linda University School of Medicine,Other,Free,,11/07/2023 03:54:13,,Active
Lau,Tani,bofyagolto@gufum.com,,,University of Auckland,4th Year,Free,,11/06/2023 15:54:56,,Active
nak,yam,y.yamen82@gmail.com,,,American University of Antigua,3rd Year,Step 1,Stripe,11/06/2023 00:00:00,12/05/2023 00:00:00,Expired
Roughia,Hussien,roughia2023ibrahim@gmail.com,,,Other,3rd Year,Free,,11/05/2023 08:52:41,,Active
Karimov,Sardor,k.sardor02@mail.ru,,,University of New England College of Osteopathic Medicine,4th Year,Free,,10/31/2023 05:25:30,,Active
Hooman,Safi,hmnsafi@gmail.com,,,Other,Other,Free,,10/29/2023 07:47:46,,Active
Tatyana,Fortune,tatyanafortunedmd@gmail.com,,,Boston University School of Medicine,Other,Free,,10/28/2023 15:54:10,,Active
Bad,Dam,badges.dams.0p@icloud.com,,,Other,2nd Year,Free,,10/28/2023 06:09:33,,Active
Luciarita,Boccuzzi,lbocc003@gmail.com,Chinchilla,,Rush Medical College of Rush University Medical Center,3rd Year,Free,,10/27/2023 19:30:54,,Active
Luciarita,Boccuzzi,luciarita_boccuzzi@rush.edu,Chinchilla,,Rush Medical College of Rush University Medical Center,3rd Year,Free,,10/27/2023 19:29:32,,Active
Buga,Kenyi,buga.cgk@gmail.com,,,Duke University School of Medicine,Other,Free,,10/27/2023 17:04:21,,Active
Hiba,Eltayeb,hbhb.fuf@gmail.com,,,Albert Einstein College of Medicine,Other,Free,,10/25/2023 04:46:34,,Active
Gabriela,Barr,gabrielasbbarr@gmail.com,,,Mercer University School of Medicine,3rd Year,Free,,10/25/2023 00:48:26,,Active
Benjamin,Boss,bossben1@msu.edu,Orca,,Michigan State University College of Human Medicine,1st Year,Free,,10/24/2023 20:49:24,,Active
lara,Kab,100053510@ku.ac.ae,Horse,,University of Tennessee Health Science Center College of Medicine,4th Year,Free,,10/24/2023 01:31:40,,Active
manav,vyas,manavvyas31922@gmail.com,,,Georgetown University School of Medicine,2nd Year,Free,,10/22/2023 18:41:28,,Active
Iman,Iman,iman004iman@gmail.com,,,University of Kentucky College of Medicine,1st Year,Free,,10/21/2023 12:02:08,,Active
Ash,Doc,dhoteashwini6@gmail.com,,,Albert Einstein College of Medicine,Other,Free,,10/21/2023 11:24:52,,Active
ash,dht,ashwinidht@gmail.com,,,Indiana University School of Medicine,4th Year,Free,,10/21/2023 08:26:54,,Active
Raman,Hothi,rhothi190@marian.edu,,,Marian University College of Osteopathic Medicine,3rd Year,Free,,10/18/2023 15:04:22,,Active
Victori,yin,victoriaa.yin@gmail.com,,Rutgers, Robert Wood Johnson Medical School,4th Year,Step 2,Stripe,10/18/2023 00:00:00,03/13/2024 18:15:30,Expired
Jude,Fahoum,jf763518@ohio.edu,Orca whale,,Ohio University Heritage College of Osteopathic Medicine-Cleveland,4th Year,Free,,10/16/2023 14:53:49,,Active
Flutura,Harold,fluharold@gmail.com,,,Other,2nd Year,Free,,10/15/2023 03:42:58,,Active
Kasongo,Mukoka ,patientmukoka@gmail.com,,,University of Virginia School of Medicine,2nd Year,Free,,10/15/2023 00:41:22,,Active
Andy,DeLaHoz,andreah.delahoz@gmail.com,,,University of Louisville School of Medicine,Other,Free,,10/12/2023 21:19:18,,Active
Aisha,maalim,jamesaaliyah74@gmail.com,,,Other,3rd Year,Free,,10/11/2023 02:21:31,,Active
Trjas,Jagtap,tejasjagtap306@gmail.com,,,Baylor College of Medicine,4th Year,Free,,10/10/2023 08:22:39,,Active
Brayan,Corona,Brayancorona704@gmail.com,Lion,,University of North Carolina School of Medicine,2nd Year,Step 1,Stripe,10/10/2023 00:00:00,02/29/2024 00:00:00,Expired
Hana,Warmflash,hanacw1998@hotmail.com,,,Oregon Health & Science University School of Medicine,2nd Year,Free,,10/07/2023 23:33:13,,Active
Michelle,Kwong,michellewskwong@gmail.com,,,Albert Einstein College of Medicine,4th Year,Free,,10/07/2023 16:03:35,,Active
Mohammed,Mohammed,Mohammed.surgeon1@gmail.com,,,Other,Other,Free,,10/07/2023 12:15:52,,Active
Michael,Walker,mwalker23@email.mmc.edu,,,Meharry Medical College School of Medicine,2nd Year,Free,,10/06/2023 15:08:06,,Active
Jordan,Gonzalez,jordan_r_gonzalez@rush.edu,,,Rush Medical College of Rush University Medical Center,1st Year,Step 1,Stripe,10/06/2023 00:00:00,10/13/2023 12:36:23,Expired
negar,most,negar.mostafaei@gmail.com,,,California Northstate University College of Medicine,Other,Free,,10/05/2023 18:02:04,,Active
Andrea,Endres,amendres@oakland.edu,,,Oakland University William Beaumont School of Medicine,1st Year,Free,,10/05/2023 10:35:51,,Active
fir,las,j0s3phw1ll@gmail.com,,,Duke University School of Medicine,Other,Free,,10/04/2023 00:00:06,,Active
sfe,kkn,pavers-hued-0h@icloud.com,,,Albert Einstein College of Medicine,4th Year,Free,,10/03/2023 18:35:25,,Active
David,Nacouzi,dvnacouzi@gmail.com,Hippogriff,,The Brody School of Medicine at East Carolina University,3rd Year,Step 2,Stripe,10/03/2023 00:00:00,12/03/2023 15:41:24,Expired
Deena,ahmed,deenaahmed17@gmail.com,,,Michigan State University College of Human Medicine,3rd Year,Free,,10/02/2023 14:10:56,,Active
heba,faraj,sosokaya96@gmail.com,,,Harvard Medical School,Other,Free,,09/30/2023 23:40:39,,Active
kainat,uddin,kainat80_@hotmail.co.uk,,,East Tennessee State University James H. Quillen College of Medicine,3rd Year,Free,,09/28/2023 18:40:42,,Active
John,Davis,jowdavis@utmb.edu,Dog,,The University of Texas Medical Branch at Galveston School of Medicine,4th Year,Free,,09/26/2023 17:11:33,,Active
Ngozika ,Obiefuna ,ngobiefuna1@gmail.com,,,A.T. Still University-Kirksville College of Osteopathic Medicine,Other,Free,,09/25/2023 05:35:22,,Active
Abdelrahman,Aly,abdellrahmanelfarra@gmail.com,,,Columbia University Vagelos College of Physicians and Surgeons,2nd Year,Free,,09/23/2023 19:08:43,,Active
khuanruethai,praituen,khuan.15b@gmail.com,,,Other,Other,Free,,09/23/2023 15:07:28,,Active
Akshar,Patel,akshar525@gmail.com,,,The University of Texas Medical Branch at Galveston School of Medicine,4th Year,Free,,09/19/2023 02:50:48,,Active
Kaitlyn,miller,junkkam98@gmail.com,,,University of Kentucky College of Medicine,2nd Year,Free,,09/18/2023 04:23:49,,Active
Anna,Jazayeri,mj120730@gmail.com,,,Other,3rd Year,Free,,09/17/2023 19:58:45,,Active
Andrew,Behrmann,andyx0897@gmail.com,,,University of Missouri-Columbia School of Medicine,Other,Free,,09/17/2023 14:57:29,,Active
Karla,Soto,karlaelisabeth2018@gmail.com,,,Duke University School of Medicine,Other,Free,,09/16/2023 00:12:18,,Active
Philip,Botelho,philipbotelho89@gmail.com,Cat,,Alabama College of Osteopathic Medicine,4th Year,Free,,09/15/2023 16:06:29,,Active
bhavya,vunnava,bhavyavunnava7@gmail.com,,,The University of Texas Southwestern Medical School,Other,Free,,09/14/2023 15:50:51,,Active
govind,gowda,govindgowda3.1.6@gmail.com,,,California Northstate University College of Medicine,Other,Free,,09/14/2023 12:06:21,,Active
Phyllis,Bradberry,pbradberry101@aol.com,,,University of Mississippi School of Medicine,2nd Year,Free,,09/10/2023 02:10:43,,Active
Fadel,Milad,Fadelalla12@gmail.com,,,Stanford University School of Medicine,4th Year,Free,,09/09/2023 15:41:36,,Active
Julissa,Sanchez,judsanch@utmb.edu,,,The University of Texas Medical Branch at Galveston School of Medicine,4th Year,Free,,09/08/2023 15:09:19,,Active
aman,octain,aoctain@gmail.com,,,Edward Via College of Osteopathic Medicine-Virginia Campus,Other,Free,,09/08/2023 02:36:31,,Active
Lauren,Shingler,lauren.shingler@sbcglobal.net,,,The Ohio State University College of Medicine,3rd Year,Step 2,Stripe,09/07/2023 00:00:00,10/06/2023 00:00:00,Expired
Hri,Svn,harrisan050@gmail.com,,,Harvard Medical School,1st Year,Free,,09/03/2023 01:25:06,,Active
William,Byas,pr.byas@gmail.com,Cat,,A.T. Still University-Kirksville College of Osteopathic Medicine,4th Year,Step 2,Stripe,08/31/2023 00:00:00,09/29/2023 00:00:00,Active
Kristy,Pham,kmp005@lsuhs.edu,,,Louisiana State University School of Medicine in Shreveport,1st Year,Free,,08/30/2023 19:56:32,,Active
rene,hooper,rene.hooper@ut.rvu.edu,,,Rocky Vista University College of Osteopathic Medicine?Southern Utah,1st Year,Free,,08/30/2023 05:22:31,,Active
Kendall,Jackson,krosejackson@gmail.com,,,Washington University in St. Louis School of Medicine,4th Year,Free,,08/29/2023 12:31:39,,Active
Cynthia,Duarte,lmntrix13@gmail.com,,,The University of Texas Medical Branch at Galveston School of Medicine,4th Year,Step 2,Stripe,08/28/2023 00:00:00,09/04/2023 18:39:43,incomplete_expired
Marc,McCoy,marc.mccoy1@ucalgary.ca,,,Tufts University School of Medicine,3rd Year,Free,,08/27/2023 19:50:37,,Active
Clare,Patterson,c.patterso@gmail.com,,,Georgia Campus-Philadelphia College of Osteopathic Medicine,2nd Year,Free,,08/27/2023 16:17:49,,Active
muhammad,sayed,w.siyed100@gmail.com,,,Harvard Medical School,4th Year,Free,,08/24/2023 22:36:05,,Active
greg,phelan,Gregphelan99@gmail.com,,,Saint George's University School of Medicine,Other,Step 1,In-App,08/24/2023 18:26:00,11/21/2023 18:26:00,Active
Ayman,Abdalla,aymanashrafmetwally2002@gmail.com,,,Other,4th Year,Free,,08/24/2023 03:52:27,,Active
Mig,Tir,dr.tiradopagan@yahoo.com,,,Other,Other,Free,,08/23/2023 23:11:32,,Active
max,todd,maximumtang@gmail.com,,,Saint Louis University School of Medicine,3rd Year,Free,,08/22/2023 21:49:55,,Active